{"text_format":"1","workbook":"xlsx","n_sheets":15,"sheets":["Formulaire","Aide","Contacts","Tiers1","Tiers2","Tiers3","Actions en régie","PDIPR","SIRET","Partenaires","Collectivités","Listes","Itinéraires","Vérif","Pieces"],"not_rendered":{"charts":1,"images":2,"macros":1,"external_links":0,"defined_names":20,"comments":1,"pivot_tables":0},"unopened":[],"bounds":{"document_bytes":16777216,"sheet_cells":100000,"rows_first":2000,"rows_last":500,"rows_between":2000,"halvings":0,"cell_chars":16384,"cell_head_chars":4096},"cells_cut":0,"cells_raw":0,"read":"whole","date_system":"1900"}

{"sheet":"Formulaire","index":0,"n_rows":60,"n_cols":23,"rows_kept":60,"cut":false,"hidden":false,"merged":[[46,4,46,6],[50,4,50,10],[52,4,55,10],[38,4,38,6],[59,18,59,22],[50,16,50,20],[52,16,52,20],[46,8,46,9],[26,4,26,5],[8,4,8,10],[16,4,16,10],[24,4,24,10],[18,4,18,5],[10,4,10,5],[10,6,10,7],[12,5,12,10],[32,4,32,10],[34,4,34,10],[36,4,36,10],[42,4,42,6],[44,4,44,6]]}
[]
[]
[null,null,"Rattachement de l'action",null,"Champs obligatoires (*)",null,null,null,null,null,null,null,null,null,"Financement de l'action",null,"Partenaire 1",null,"Partenaire 2",null,"Partenaire 3"]
[]
[null,null,null,"Date :",null,null,null,null,null,null,null,null,null,null,null,"Part de financement",{"$f":"IF(OR(E9=\"\",E9=\" \"),\"Non\",\"Oui\")","v":"Non"},null,{"$f":"IF(OR(E17=\"\",E17=\" \"),\"Non\",\"Oui\")","v":"Non"},null,{"$f":"IF(OR(E25=\"\",E25=\" \"),\"Non\",\"Oui\")","v":"Non"},{"$f":"IF(P5=\"Oui\",1,\"\")","v":""},{"$f":"IF(Q5=\"Oui\",1,\"\")","v":""}]
[]
[null,null,"Portage",null,"Date limite de dépôt des dossiers pour l'année N+1 : le 15 OCTOBRE de l'année en cours",null,null,null,null,null,null,null,null,null,null,"Taux :",{"$f":"IF(E15=\"\",\"\",E15)","v":""},null,{"$f":"IF(E23=\"\",\"\",E23)","v":""},null,{"$f":"IF(E31=\"\",\"\",E31)","v":""},{"$f":"IF(P7=\"Oui\",1,\"\")","v":""},"(% d'autofinancement)"]
[]
[null,null,null,"Libellé du partenaire 1 * :",null,null,null,null,null,null,null,null,null,null,null,"Montant :",{"$f":"IF(OR(Q5=\"Non\",Q7=\"\"),0,($E$58*Q7)/100)","v":0},null,{"$f":"IF(OR(S5=\"Non\",S7=\"\"),0,($E$58*S7)/100)","v":0},null,{"$f":"IF(OR(U5=\"Non\",U7=\"\"),0,($E$58*U7)/100)","v":0},null,"(Montant global x Taux)"]
[]
[null,null,null,"Type * :",null,null,"Assujetti à la TVA * :",null,"Non",null,null,null,null,null,null,"Département","Oui",null,{"$f":"IF(M11=\"Oui\",1,\"\")","v":""},"","",null,{"$f":"IF(Q11=\"Oui\",1,\"\")","v":1}]
[null,null,null,null,null,null,null,null,null,null,null,null,null,null,null,null,null,null,"","",""]
[null,null,null,"Partenaire déjà enregistré * :",null,{"$f":"Listes!V9","v":""},null,null,null,null,null,null,null,null,null,"Type de fonds :","TA",null,"","",""]
[]
[null,null,null,"Part du portage * :",null,"(Taux du portage assuré par le partenaire 1)",null,null,null,null,null,null,null,null,null,"Taux * :",null,null,"(% de financement)"]
{"$rows_left_out":46}
{"sheet":"Aide","index":1,"n_rows":0,"n_cols":0,"rows_kept":0,"cut":false,"hidden":true,"merged":[]}

{"sheet":"Contacts","index":2,"n_rows":32,"n_cols":7,"rows_kept":32,"cut":false,"hidden":true,"merged":[]}
[null,"Service","Agent","Fonction","Secteur de compétence","Téléphone","Email"]
[{"$f":"IF($C$26=4,1,\"\")","v":""},"Service actions foncières et urbanisme"]
[{"$f":"IF($C$26=4,2,\"\")","v":""},null,"Benoît Fournier","Responsable du service","Département","03 83 94 59 30","bfournier@departement54.fr"]
[{"$f":"IF($C$26=4,3,\"\")","v":""},null,"Christelle During","Gestion administrative et financière","Département",383945691,"dduring@departement54.fr"]
[{"$f":"IF($C$26=4,4,\"\")","v":""},null,"Corinne Brunelot","Chargée d'études","Département",383945365,"cbrunelot@departement54.fr"]
[{"$f":"IF($C$26=4,5,\"\")","v":""},null,"Denise Bonetti","Gestion administrative et financière","Département",383945698,"dbonetti@departement54.fr"]
[{"$f":"IF($C$26=4,6,\"\")","v":""},null,"Laëtitia Aubertin","Gestion administrative et financière","Département",383945688,"laubertin@departement54.fr"]
[]
[{"$f":"IF(OR(OR($C$26=1,$C$26=2),$C$26=3),1,\"\")","v":""},"Service patrimoine naturel"]
[null,null,"Alizé Bailleul","Technicienne Natura 2000","Département",383945652,"abailleul@departement54.fr"]
[null,null,"Fabrina Salas","Gestion administrative et financière","Département",383945687,"fsalas@departement54.fr"]
[{"$f":"IF($C$26=2,2,\"\")","v":""},null,"Didier Haillant","Technicien randonnée et environnement","Département",383945854,"dhaillant@departement54.fr"]
[{"$f":"IF(OR($C$26=1,$C$26=3),2,\"\")","v":""},null,"Guillaume Godfroy","Chargé de mission","ENS départementaux",383945856,"ggodfroy@departement54.fr"]
[{"$f":"IF(OR($C$26=1,$C$26=3),3,\"\")","v":""},null,"Muriel Ballié","Chargée de mission (responsable du service)","Grand Nancy, Terres de Lorraine",383945690,"dballie@departement54.fr"]
[null,null,"Nathalie Malbreil","Chargée de mission","Lunévillois",383945533,"nmalbreil@departement54.fr"]
{"$rows_left_out":18}
{"sheet":"Tiers1","index":3,"n_rows":30,"n_cols":4,"rows_kept":30,"cut":false,"hidden":true,"merged":[[1,2,1,8],[6,3,6,5],[4,3,4,8],[14,3,14,7],[24,3,24,6],[18,3,18,6]]}
[]
[null,null,"Création d'un compte tiers"]
[]
[]
[null,null,"Libellé de la structure"]
[]
[null,null,"Président/Responsable"]
[]
[null,null,null,"Adresse du Siège social"]
[]
[null,null,"Numéro de rue"]
[]
[null,null,"Etage"]
[]
[null,null,"Rue"]
{"$rows_left_out":16}
{"sheet":"Tiers2","index":4,"n_rows":30,"n_cols":4,"rows_kept":30,"cut":false,"hidden":true,"merged":[[24,3,24,6],[1,2,1,8],[4,3,4,8],[6,3,6,5],[14,3,14,7],[18,3,18,6]]}
[]
[null,null,"Création d'un compte tiers"]
[]
[]
[null,null,"Libellé de la structure"]
[]
[null,null,"Président/Responsable"]
[]
[null,null,null,"Adresse du Siège social"]
[]
[null,null,"Numéro de rue"]
[]
[null,null,"Etage"]
[]
[null,null,"Rue"]
{"$rows_left_out":16}
{"sheet":"Tiers3","index":5,"n_rows":30,"n_cols":4,"rows_kept":30,"cut":false,"hidden":true,"merged":[[24,3,24,6],[1,2,1,8],[4,3,4,8],[6,3,6,5],[14,3,14,7],[18,3,18,6]]}
[]
[null,null,"Création d'un compte tiers"]
[]
[]
[null,null,"Libellé de la structure"]
[]
[null,null,"Président/Responsable"]
[]
[null,null,null,"Adresse du Siège social"]
[]
[null,null,"Numéro de rue"]
[]
[null,null,"Etage"]
[]
[null,null,"Rue"]
{"$rows_left_out":16}
{"sheet":"Actions en régie","index":6,"n_rows":17,"n_cols":8,"rows_kept":17,"cut":false,"hidden":true,"merged":[[17,2,20,7],[2,2,2,7],[12,2,12,6]]}
[]
[]
[null,null,{"$f":"IF(Formulaire!$E$45=\"Randonnée\",UPPER(Formulaire!$E$45&\" - \"&\"Balades 54\"),UPPER(Formulaire!$E$45))","v":""}]
[]
[null,null,"Type de mission","Forfait journalier","Nombre de demi-journées prévisionnelles","Coût €","Taux de subvention (60% maxi)","Subvention CD54 €"]
[null,null,"Réalisation d'études de diagnostics et de suivis",450,null,{"$f":"IF(E6<1,\"\",D6/2*E6)","v":""},null,{"$f":"IF(OR(OR(E6<1,F6<1),G6<1),\"\",F6*G6/100)","v":""}]
[null,null,"Encadrement de la réalisation d'études , de diagnostics et de suivis",250,null,"",null,""]
[null,null,"Réalisation de relevés géographiques pour l'application Balades 54\navec intégration de contenus : textes descriptifs, photos…",250,null,"",null,""]
[null,null,"Travaux en régie",150,null,"",null,""]
[null,null,"Suivi de travaux de sites",250,null,"",null,""]
[null,null,"Conception d'outils de communication portant sur la connaissance\net la gestion des sites : contenus de panneaux, infosites…",250,null,"",null,""]
[null,null,null,null,{"$f":"IF(AND(SUM(E6:E7,E9:E11)>0,Formulaire!E45=\"Randonnée\"),1,IF(AND(E8>0,Formulaire!E45<>\"Randonnée\"),2,0))","v":0},null,{"$f":"MAX(G6:G11)","v":0},{"$f":"IF(OR(E12>0,G12>60),1,0)","v":0}]
[null,null,"Total des actions en régie",null,null,null,null,{"$f":"SUM(H6:H12)","v":0}]
[]
[]
{"$rows_left_out":3}
{"sheet":"PDIPR","index":7,"n_rows":15,"n_cols":12,"rows_kept":15,"cut":false,"hidden":true,"merged":[[7,6,7,8],[3,6,3,8],[1,1,1,11],[6,1,6,3],[4,6,4,8],[5,6,5,8],[6,6,6,8],[13,9,14,9],[13,10,14,10],[13,11,14,11],[13,7,14,7],[9,1,10,5],[13,8,14,8],[13,1,14,1],[13,2,14,2],[13,3,14,3],[13,4,14,4],[13,5,13,6]]}
[]
[null,"Entretien des itinéraires de randonnée inscrits au PDIPR"]
[]
[null,null,null,null,null,null,{"$f":"IF(Formulaire!E41=\"\",\"\",\"Entretien \"&Formulaire!E41)","v":""},null,null,"Départemental","Local","Total"]
[null,null,null,null,null,null,"Nbre d'itinéraires entretenus",null,null,{"$f":"COUNTIFS(D16:D64999,\"departemental\",I16:I64999,\">0\")","v":0},{"$f":"COUNTIFS(D16:D64999,\"local\",I16:I64999,\">0\")","v":0},{"$f":"IF(J5+K5=0,0,SUM(J5:K5))&\" / \"&COUNTA(B16:B64999)","v":"0 / 0"}]
[null,"Liste des itinéraires par EPCI",null,null,null,null,"Km entretenus",null,null,{"$f":"SUMIFS(E16:E64999,D16:D64999,\"departemental\",I16:I64999,\">0\")","v":0},{"$f":"SUMIFS(E16:E64999,D16:D64999,\"local\",I16:I64999,\">0\")","v":0},{"$f":"IF(SUM(J6:K6)=0,0&\" / \"&SUM(E16:E64999),SUM(J6:K6)&\" / \"&SUM(E16:E64999))","v":"0 / 0"}]
[null,null,null,null,null,null,"Coût TTC",null,null,{"$f":"SUMIFS(I16:I65000,D16:D65000,\"departemental\")","v":0},{"$f":"SUMIFS(I16:I65000,D16:D65000,\"Local\")","v":0},{"$f":"SUM(J7:K7)","v":0}]
[null,null,null,null,null,null,"Montant prévisionnel de l'aide",null,null,{"$f":"SUMIFS(L16:L65000,D16:D65000,\"departemental\")","v":0},{"$f":"SUMIFS(L16:L65000,D16:D65000,\"Local\")","v":0},{"$f":"ROUND(SUM(J8:K8),0)","v":0}]
[null,"Observations"]
[]
[null,null,null,null,null,null,null,null,null,"Entretenus",{"$f":"ROUND((SUM(J6:K6)/SUM(E16:E64999))*100,0)","v":{"$error":"#DIV/0!"}}]
[null,null,null,"Le montant des dépenses comprend par itinéraire :",null,null,null,null,null,"Non entretenus",{"$f":"ROUND(((SUM(E16:E64999)-SUM(J6:K6))/SUM(E16:E64999))*100,0)","v":{"$error":"#DIV/0!"}}]
[null,"La liste ci-dessous reprenant les itinéraires inscrits ou éligibles",null,"l'achat du matériel de balisage + les frais de déplacements"]
[null,"Numéro","Nom de l'itinéraire","Intérêt","Km","Travaux",null,"Mobilier","Coût TTC","Plafond\npar Km","Taux","Aide calculée"]
[null,null,null,null,null,"Balisage","ELA/DEB"]
{"$rows_left_out":1}
{"sheet":"SIRET","index":8,"n_rows":0,"n_cols":0,"rows_kept":0,"cut":false,"hidden":true,"merged":[]}

{"sheet":"Partenaires","index":9,"n_rows":83,"n_cols":4,"rows_kept":83,"cut":false,"hidden":true,"merged":[]}
[]
["A VELO EN JARNISY","Association",null,"AIRPAS"]
["AGAPE","Association",null,"ARSEM"]
["AIR ET EAU","Association",null,"ASP FORET DE HAYE"]
["AIRPAS","Association",null,"ASSOCIATION AIR ET EAU"]
["ARSEM","Association",null,"ASSOCIATION GUERRE EN VOSGES"]
["ASSOCIATION INTERCOMMUNALE DES SENTIERS DE LA LINOTTE","Association",null,"ASSOCIATION INTERCOMMUNALE DES SENTIERS DE LA LINOTTE"]
["ASSOCIATION INTERCOMMUNALE DES SENTIERS DE LA MIRABELLE","Association",null,"ASSOCIATION INTERCOMMUNALE DES SENTIERS DE LA MIRABELLE"]
["ASSOCIATION INTERCOMMUNALE DES SENTIERS DES DEUILLES","Association",null,"ASSOCIATION INTERCOMMUNALE DES SENTIERS DES DEUILLES"]
["BASE SOLAN","Organisme public",null,"CA D EPINAL"]
["CLUB ALPIN FRANCAIS DE NANCY","Association",null,"CDRP 54 - COMMISSION SENTIERS 54"]
["CLUB VOSGIEN 54","Association",null,"CLUB ALPIN FRANCAIS DE NANCY"]
["CLUB VOSGIEN D AZERAILLES","Association",null,"CLUB VOSGIEN 54"]
["CLUB VOSGIEN DE BADONVILLER","Association",null,"CLUB VOSGIEN D AZERAILLES"]
["CLUB VOSGIEN DE BAYON-GERBEVILLER","Association",null,"CLUB VOSGIEN DE BADONVILLER"]
{"$rows_left_out":69}
{"sheet":"Collectivités","index":10,"n_rows":596,"n_cols":10,"rows_kept":596,"cut":false,"hidden":true,"merged":[]}
[0]
[1,"CA DE LONGWY","2, rue de Lexy - CS 11432 Réhon","54414 LONGWY Cedex","LONGWY",null,"ABAUCOURT",54001,"COMMUNAUTE DE COMMUNES DE SEILLE ET GRAND COURONNE",5]
[2,"CA DE SAINT-DIE-DES-VOSGES","7, place Saint-Martin","88100 SAINT-DIE-DES-VOSGES","LUNEVILLOIS",null,"ABBEVILLE-LES-CONFLANS",54002,"COMMUNAUTE DE COMMUNES ORNE LORRAINE CONFLUENCES",17]
[3,"CC CŒUR DU PAYS HAUT","71, route de Briey","54560 AUDUN-LE-ROMAN","BRIEY",null,"ABONCOURT",54003,"COMMUNAUTE DE COMMUNES DU PAYS DE COLOMBEY ET DU SUD TOULOIS",10]
[4,"CC DE SEILLE ET GRAND COURONNE","47, rue Saint Barthélémy","54280 CHAMPENOUX","VAL DE LORRAINE",null,"AFFLEVILLE",54004,"COMMUNAUTE DE COMMUNES ORNE LORRAINE CONFLUENCES",17]
[5,"CC DE VEZOUZE EN PIEMONT","38, rue de la Voise - BP 8","54450 BLÂMONT","LUNEVILLOIS",null,"AFFRACOURT",54005,"COMMUNAUTE DE COMMUNES ORNE LORRAINE CONFLUENCES",11]
[6,"CC DES PAYS DU SEL ET DU VERMOIS","3, rue Louis Majorelle - ZAC du Saulcy","54110 DOMBASLE-SUR-MEURTHE","LUNEVILLOIS",null,"AGINCOURT",54006,"COMMUNAUTE DE COMMUNES ORNE LORRAINE CONFLUENCES",5]
[7,"CC DU BASSIN DE POMPEY","Rue des 4 Eléments - BP 60008","54340 POMPEY","VAL DE LORRAINE",null,"AINGERAY",54007,"COMMUNAUTE DE COMMUNES ORNE LORRAINE CONFLUENCES",19]
[8,"CC DU BASSIN DE PONT-A-MOUSSON","75, allée Louis Camillle Maillard - BP 50285","54701 PONT-A-MOUSSON Cedex","VAL DE LORRAINE",null,"ALLAIN",54008,"COMMUNAUTE DE COMMUNES ORNE LORRAINE CONFLUENCES",10]
[9,"CC DU PAYS DE COLOMBEY ET DU SUD TOULOIS","6, impasse de la Colombe - BP 12","54170 COLOMBEY-LES-BELLES","TERRES DE LORRAINE",null,"ALLAMONT",54009,"COMMUNAUTE DE COMMUNES ORNE LORRAINE CONFLUENCES",17]
[10,"CC DU PAYS DU SAINTOIS","21, rue de la Gare","54116 TANTONVILLE","TERRES DE LORRAINE",null,"ALLAMPS",54010,"COMMUNAUTE DE COMMUNES ORNE LORRAINE CONFLUENCES",10]
[11,"CC DU PAYS DU SANON","7, place de la Fontaine","54370 EINVILLE-AU-JARD","LUNEVILLOIS",null,"ALLONDRELLE-LA-MALMAISON",54011,"COMMUNAUTE DE COMMUNES ORNE LORRAINE CONFLUENCES",18]
[12,"CC DU PAYS HAUT VAL D'ALZETTE","Le Laboratoire - 390, Rue du Laboratoire, Site de Micheville","57390 Audun-le-Tiche","LONGWY",null,"AMANCE",54012,"COMMUNAUTE DE COMMUNES ORNE LORRAINE CONFLUENCES",5]
[13,"CC DU TERRITOIRE DE LUNEVILLE A BACCARAT","11, avenue de la Libération - BP 80047","54300 LUNÉVILLE","LUNEVILLOIS",null,"AMENONCOURT",54013,"COMMUNAUTE DE COMMUNES ORNE LORRAINE CONFLUENCES",6]
[14,"CC MAD ET MOSELLE","2 bis, rue Henri Poulet","54470 THIAUCOURT-REGNIEVILLE","VAL DE LORRAINE",null,"ANCERVILLER",54014,"COMMUNAUTE DE COMMUNES ORNE LORRAINE CONFLUENCES",6]
{"$rows_left_out":582}
{"sheet":"Listes","index":11,"n_rows":37,"n_cols":23,"rows_kept":37,"cut":false,"hidden":true,"merged":[[12,10,12,12],[23,9,25,9],[17,1,17,2]]}
[null,"Années",null,null,"Types",null,null,"Fonct / Invest",null,null,"Ligne",null,"Partenaire",null,"Oui/Non",null,"Taux",null,"Numéro",null,"Aide publique","Vérif"]
[0,null,null,0,null,null,null,null,null,0,null,null,null,null,null,null,10,null,0,null,{"$f":"Formulaire!E15*V2","v":0},{"$f":"IF(Formulaire!E11=\"Association\",0,1)","v":1}]
[1,{"$f":"M21","v":2025},null,1,"Espaces Naturels Sensibles",null,{"$f":"IF(AND($C$10=2,$D$10=1),MAX($G$2:G2)+1,IF(AND($C$10=2,$D$10=3),MAX($G$2:G2)+1,IF(AND($C$10=2,$D$10=4),MAX($G$2:G2)+1,\"\")))","v":""},"Acquisitions",null,1,"Fonctionnement",null,"Association",null,"Oui",null,20,null,null,null,{"$f":"Formulaire!E23*V3","v":0},{"$f":"IF(Formulaire!E19=\"Association\",0,1)","v":0}]
[2,{"$f":"B3+1","v":2026},null,2,"Randonnée",null,{"$f":"IF(AND($C$10=2,$D$10=1),MAX($G$2:G3)+1,IF(AND($C$10=2,$D$10=2),MAX($G$2:G3)+1,IF(AND($C$10=2,$D$10=3),MAX($G$2:G3)+1,IF(AND($C$10=2,$D$10=4),MAX($G$2:G3)+1,\"\"))))","v":""},"Actions en régie",null,2,"Investissement",null,"Commune",null,"Non",null,30,null,null,null,{"$f":"Formulaire!E31*V4","v":0},{"$f":"IF(Formulaire!E27=\"Association\",0,1)","v":1}]
[3,{"$f":"B4+1","v":2027},null,3,"Ressource en Eau",null,{"$f":"IF(AND($C$10=2,$D$10=1),MAX($G$2:G4)+1,IF(AND($C$10=2,$D$10=3),MAX($G$2:G4)+1,IF(AND($C$10=2,$D$10=4),MAX($G$2:G4)+1,\"\")))","v":""},"Etudes",null,null,null,null,"EPCI",null,null,null,40,null,null,null,{"$f":"Formulaire!Q15","v":0}]
[4,{"$f":"B5+1","v":2028},null,4,"TVB/Paysages/Espèces",null,{"$f":"IF(AND($C$10=1,$D$10=1),MAX($G$2:G5)+1,IF(AND($C$10=1,$D$10=2),MAX($G$2:G5)+1,IF(AND($C$10=1,$D$10=3),MAX($G$2:G5)+1,IF(AND($C$10=1,$D$10=4),MAX($G$2:G5)+1,\"\"))))","v":""},"Gestion/Entretien",null,null,null,null,"Organisme public",null,null,null,50,null,null,null,{"$f":"Formulaire!Q23","v":0}]
[5,{"$f":"B6+1","v":2029},null,null,null,null,null,"Moyens généraux",null,null,null,null,null,null,null,null,60,null,null,null,{"$f":"Formulaire!Q31","v":0}]
[6,{"$f":"B7+1","v":2030},null,null,null,null,{"$f":"IF(AND($C$10=1,$D$10=1),MAX($G$2:G7)+1,IF(AND($C$10=1,$D$10=2),MAX($G$2:G7)+1,IF(AND($C$10=1,$D$10=3),MAX($G$2:G7)+1,IF(AND($C$10=1,$D$10=4),MAX($G$2:G7)+1,\"\"))))","v":""},"Outils de communication",null,null,null,null,null,null,null,null,70,null,null,null,{"$f":"Formulaire!Q55","v":0},{"$f":"IF(Formulaire!Q53=\"PUBLIC\",1,0)","v":0}]
[null,null,"LIGNE","TYPE",null,null,null,"Petit matériel",null,null,null,null,null,null,null,null,80,null,null,null,{"$f":"SUM(U2:U8)","v":0},{"$f":"IF(U9>80,\"L'aide publique cumulée dépasse le taux maxi de 80% autorisé !\",\"\")","v":""}," "]
[null,null,{"$f":"IF(Formulaire!E43=\"\",0,LOOKUP(Formulaire!E43,LIGNE,Listes!J2:J4))","v":0},{"$f":"IF(Formulaire!E45=\"\",0,LOOKUP(Formulaire!E45,TYPE,Listes!D2:D8))","v":0},null,null,{"$f":"IF(AND($C$10=1,$D$10=1),MAX($G$2:G9)+1,IF(AND($C$10=1,$D$10=3),MAX($G$2:G9)+1,IF(AND($C$10=1,$D$10=4),MAX($G$2:G9)+1,\"\")))","v":""},"Suivis écologiques",null,null,null,null,null,null,null,null,90]
[null,null,{"$f":"MAX(G2:G12)","v":0},0,null,null,{"$f":"IF(AND($C$10=2,$D$10=1),MAX($G$2:G10)+1,IF(AND($C$10=2,$D$10=2),MAX($G$2:G10)+1,IF(AND($C$10=2,$D$10=3),MAX($G$2:G10)+1,IF(AND($C$10=2,$D$10=4),MAX($G$2:G10)+1,\"\"))))","v":""},"Travaux",null,null,null,null,null,null,null,null,100]
[null,null,1,{"$f":"LOOKUP(C12,G2:G12)","v":{"$error":"#N/A"}},{"$f":"IF(D12=\"\",\"\",IF(LOOKUP(D12,$G$2:$G$12,$H$2:$H$12)=0,\"\",LOOKUP(D12,$G$2:$G$12,$H$2:$H$12)))","v":{"$error":"#N/A"}}]
[null,null,2,{"$f":"IF(MAX($G$2:$G$12)>=2,2,\"\")","v":""},{"$f":"IF(D13=\"\",\"\",IF(LOOKUP(D13,$G$2:$G$12,$H$2:$H$12)=0,\"\",LOOKUP(D13,$G$2:$G$12,$H$2:$H$12)))","v":""},null,null,null,null,null,"Date butoire"]
[null,null,3,{"$f":"IF(MAX($G$2:$G$12)>=3,3,\"\")","v":""},{"$f":"IF(D14=\"\",\"\",IF(LOOKUP(D14,$G$2:$G$12,$H$2:$H$12)=0,\"\",LOOKUP(D14,$G$2:$G$12,$H$2:$H$12)))","v":""},null,null,null,null,null,"Aujourd'hui",null,{"$f":"TODAY()","v":"2024-09-03"},null,null,null,"Fait (attente confirmation des dates butoirs pour 2021 et après)"]
[null,null,4,{"$f":"IF(MAX($G$2:$G$12)>=4,4,\"\")","v":""},{"$f":"IF(D15=\"\",\"\",IF(LOOKUP(D15,$G$2:$G$12,$H$2:$H$12)=0,\"\",LOOKUP(D15,$G$2:$G$12,$H$2:$H$12)))","v":""},null,null,null,null,null,"ANNEE",null,{"$f":"YEAR(M14)","v":2024},null,null,null," - Formule à saisir en B3 de cette feuille : = M21"]
{"$rows_left_out":23}
{"sheet":"Itinéraires","index":12,"n_rows":554,"n_cols":7,"rows_kept":554,"cut":false,"hidden":true,"merged":[]}
["id_circ","nom_circuit","interet","longkm","epci","entretien","pdipr"]
[1,"CIRCUIT DU MALNOY","LOCAL",3.68,"CC DU BASSIN DE POMPEY","CLUB ALPIN FRANCAIS DE NANCY",1]
[3,"CIREY-SUR-VEZOUZE - BERTRAMBOIS","LOCAL",5.09,"CC DE VEZOUZE EN PIEMONT","CLUB VOSGIEN DE LA VEZOUZE",1]
[5,"CIRCUIT DU LEOMONT ET DU MEHON","LOCAL",11.92,"CC DU PAYS DU SANON","LES RANDONNEURS DU SANON ET DU LUNEVILLOIS",1]
[6,"LE VALLON DU JOLIVE","LOCAL",14.05,"CC DU PAYS DE COLOMBEY ET DU SUD TOULOIS","CDRP 54 - COMMISSION SENTIERS 54",1]
[7,"CIRCUIT DU BRENON","DEPARTEMENTAL",15.34,"CC DU PAYS DE COLOMBEY ET DU SUD TOULOIS","ASSOCIATION INTERCOMMUNALE DES SENTIERS DE LA MIRABELLE",1]
[8,"CIRCUIT DES VERRIERS","LOCAL",15.41,"CC DU TERRITOIRE DE LUNEVILLE A BACCARAT","CLUB VOSGIEN D AZERAILLES",1]
[9,"GERBEVILLER-GIRIVILLER-GERBEVILLER","LOCAL",20.59,"CC MEURTHE, MORTAGNE, MOSELLE","CLUB VOSGIEN DE BAYON-GERBEVILLER",1]
[10,"GRAND TOUR DE GERBEVILLER","DEPARTEMENTAL",39.99,"CC MEURTHE, MORTAGNE, MOSELLE","CLUB VOSGIEN DE BAYON-GERBEVILLER",1]
[11,"GERBEVILLER-QUETILLE","DEPARTEMENTAL",9.65,"CC MEURTHE, MORTAGNE, MOSELLE","CLUB VOSGIEN DE BAYON-GERBEVILLER",1]
[12,"VALLOIS-GERBEVILLER","LOCAL",9.7899999999999991,"CC DU TERRITOIRE DE LUNEVILLE A BACCARAT","CLUB VOSGIEN DE BAYON-GERBEVILLER",1]
[13,"CIRCUIT DES BRANDONS","LOCAL",13.25,"CC DU PAYS DU SAINTOIS","LES RANDONNEURS DU SAINTOIS",1]
[14,"CIRCUIT DU METAY","LOCAL",14.36,"CC DU PAYS DU SAINTOIS","LES RANDONNEURS DU SAINTOIS",1]
[15,"CIRCUIT DU PAYS DE HAROUE","LOCAL",15.98,"CC DU PAYS DU SAINTOIS","LES RANDONNEURS DU SAINTOIS",1]
[16,"CIRCUIT A","LOCAL",12.33,"METROPOLE DU GRAND NANCY","CLUB ALPIN FRANCAIS DE NANCY",1]
{"$rows_left_out":540}
{"sheet":"Vérif","index":13,"n_rows":53,"n_cols":11,"rows_kept":53,"cut":false,"hidden":true,"merged":[]}
["Portage",null,"1 = renseigné",null,null,null,"Vérifications",null,null,{"$f":"MAX(H:H)","v":12}]
[null,"Libellé du partenaire 1 :",{"$f":"IF(Formulaire!E9=\"\",0,1)","v":0},null,null,null,{"$f":"IF(AND(SUM(C2:C5)>0,SUM(C2:C5)<4),\"Partenaire 1 : renseignements incomplets\",\"\")","v":""},{"$f":"IF(G2=\"\",\"\",1)","v":""},null,1,{"$f":"IF(J2>$J$1,\"\",\"- \"&LOOKUP(J2,$H$2:$H$53,$G$2:$G$53))","v":"- Partenaire 2 : renseignements incomplets"}]
[null,"Type :",{"$f":"IF(Formulaire!E11=\"\",0,1)","v":0},null,null,null,null,null,null,2,{"$f":"IF(J3>$J$1,\"\",\"- \"&LOOKUP(J3,$H$2:$H$53,$G$2:$G$53))","v":"- Territoire d'EPCI à renseigner"}]
[null,"Partenaire déjà enregistré :",{"$f":"IF(Formulaire!E13=\"\",0,1)","v":0},null,null,null,null,null,null,3,"- Année de programmation à renseigner"]
[null,"Part du portage :",{"$f":"IF(Formulaire!E15=\"\",0,1)","v":0},null,null,null,null,null,null,4,"- Section à renseigner"]
[null,"Libellé du partenaire 2 :",{"$f":"IF(Formulaire!E17=\"\",0,1)","v":0},null,null,null,{"$f":"IF(AND(SUM(C6:C9)>0,SUM(C6:C9)<4),\"Partenaire 2 : renseignements incomplets\",\"\")","v":"Partenaire 2 : renseignements incomplets"},{"$f":"IF(G6=\"\",\"\",MAX($H$2:H5)+1)","v":1},null,5,"- Thème de l'action à renseigner"]
[null,"Type :",{"$f":"IF(Formulaire!E19=\"\",0,1)","v":1},null,null,null,null,null,null,6,"- Type d'action à renseigner"]
[null,"Partenaire déjà enregistré :",{"$f":"IF(Formulaire!E21=\"\",0,1)","v":0},null,null,null,null,null,null,7,"- Libellé de l'action à renseigner"]
[null,"Part du portage :",{"$f":"IF(Formulaire!E23=\"\",0,1)","v":0},null,null,null,null,null,null,8,"- Descriptif technique à renseigner"]
[null,"Libellé du partenaire 3 :",{"$f":"IF(Formulaire!E25=\"\",0,1)","v":0},null,null,null,{"$f":"IF(AND(SUM(C10:C13)>0,SUM(C10:C13)<4),\"Partenaire 2 : renseignements incomplets\",\"\")","v":""},{"$f":"IF(G10=\"\",\"\",MAX($H$2:H9)+1)","v":""},null,9,"- Montant global de l'action à renseigner"]
[null,"Type :",{"$f":"IF(Formulaire!E27=\"\",0,1)","v":0},null,null,null,null,null,null,10,"- Montant subventionnable à renseigner"]
[null,"Partenaire déjà enregistré :",{"$f":"IF(Formulaire!E29=\"\",0,1)","v":0}]
[null,"Part du portage :",{"$f":"IF(Formulaire!E31=\"\",0,1)","v":0}]
[null,"Territoire d'EPCI * :",{"$f":"IF(Formulaire!E33=\"\",0,1)","v":0},null,null,null,{"$f":"IF(C14=0,\"Territoire d'EPCI à renseigner\",\"\")","v":"Territoire d'EPCI à renseigner"},{"$f":"IF(G14=\"\",\"\",MAX($H$2:H13)+1)","v":2}]
[null,"Année de programmation * :",{"$f":"IF(Formulaire!E41=\"\",0,1)","v":0},null,null,null,{"$f":"IF(C15=0,\"Année de programmation à renseigner\",\"\")","v":"Année de programmation à renseigner"},{"$f":"IF(G15=\"\",\"\",MAX($H$2:H14)+1)","v":3}]
{"$rows_left_out":39}
{"sheet":"Pieces","index":14,"n_rows":476,"n_cols":8,"rows_kept":476,"cut":false,"hidden":true,"merged":[]}
[null,"Listing",null,null,{"$f":"MAX(C:C)","v":0},"Récapitulatif",104]
["Fonctionnement",null,null,null,{"$f":"IF(1>$E$1,\"\",1)","v":""},{"$f":"IF(LOOKUP(E2,C:C,B:B)=0,\"\",LOOKUP(E2,C:C,B:B))","v":""},{"$f":"LEN(F2)","v":0},""]
["Randonnée",null,null,null,{"$f":"IF(2>$E$1,\"\",2)","v":""},"",0,""]
["Animations/Formations",null,{"$f":"IF(AND(AND(Formulaire!$E$43=A2,Formulaire!$E$45=A3),Formulaire!$E$47=A4),\"Oui\",\"\")","v":""},null,{"$f":"IF(3>$E$1,\"\",3)","v":""},"",0,""]
[null,"- Le contenu des actions et des programmes préalablement définis,",{"$f":"IF(C4=\"Oui\",1,\"\")","v":""},null,{"$f":"IF(4>$E$1,\"\",4)","v":""},"",0,""]
[null,"- le descriptif des programmes et outils pédagogiques utilisés,",{"$f":"IF(C4=\"Oui\",2,\"\")","v":""},null,{"$f":"IF(5>$E$1,\"\",5)","v":""},"",0,""]
[null,"- les articulations avec les animations et formations du Conseil Départemental sur le territoire où le circuit est implanté, et dans le cas où le bénéficiaire est un partenaire privé, les articulations avec la politique d’animation et de formation de la collectivité locale sur le territoire de laquelle le site est implanté,",{"$f":"IF(C4=\"Oui\",3,\"\")","v":""},null,{"$f":"IF(6>$E$1,\"\",6)","v":""},"",0,""]
[null,"- le calendrier d’intervention avec le public concerné pour chaque animation (1/2 journée ou journée),",{"$f":"IF(C4=\"Oui\",4,\"\")","v":""},null,{"$f":"IF(7>$E$1,\"\",7)","v":""},"",0,""]
[null,"- les références des animateurs,",{"$f":"IF(C4=\"Oui\",5,\"\")","v":""},null,{"$f":"IF(8>$E$1,\"\",8)","v":""},"",0,""]
[null,"- si besoin, les éléments justificatifs du marché ou de l’appel à projet.",{"$f":"IF(C4=\"Oui\",6,\"\")","v":""},null,{"$f":"IF(9>$E$1,\"\",9)","v":""},"",0,""]
[null,null,{"$f":"IF(C4=\"Oui\",7,\"\")","v":""},null,{"$f":"IF(10>$E$1,\"\",10)","v":""},"",0,""]
[null,null,{"$f":"IF(C4=\"Oui\",8,\"\")","v":""}]
[null,null,{"$f":"IF(C4=\"Oui\",9,\"\")","v":""}]
[null,null,{"$f":"IF(C4=\"Oui\",10,\"\")","v":""}]
["Gestion/Entretien",null,{"$f":"IF(AND(AND(Formulaire!$E$43=$A$2,Formulaire!$E$45=$A$3),Formulaire!$E$47=A15),\"Oui\",\"\")","v":""}]
{"$rows_left_out":461}